Reaction Details
TargetTyrosine-protein kinase receptor UFO
LigandBDBM50413752
Substrate/Competitorn/a
Meas. Tech.ChEMBL_701625 (CHEMBL1656384)
IC50>10000±n/a nM
Citation Liniger, MNeuhaus, CHofmann, TFransioli-Ignazio, LJordi, MDrueckes, PTrappe, JsFabbro, D Kinase Inhibition by Deoxy Analogues of the Resorcylic Lactone L-783277 ACS Med Chem Lett2:22-27 (2011) 
 
Tyrosine-protein kinase receptor UFO
Name:Tyrosine-protein kinase receptor UFO
Type:Enzyme
Mol. Mass.:98316.97
Organism:Homo sapiens (Human)
Description:P30530
Residue:894
BDBM50413752
NameBDBM50413752
Synonyms:CHEMBL2012519 | L-783277
TypeSmall organic molecule
Emp. Form.C19H24O7
Mol. Mass.364.3897
SMILESCOc1cc(O)c2c(CCCC(=O)C(=O)C(O)CCC[C@H](C)OC2=O)c1