Reaction Details
TargetEphrin type-A receptor 4
LigandBDBM50413752
Substrate/Competitorn/a
Meas. Tech.ChEMBL_701632 (CHEMBL1656391)
IC50>10000±n/a nM
Citation Liniger, MNeuhaus, CHofmann, TFransioli-Ignazio, LJordi, MDrueckes, PTrappe, JsFabbro, D Kinase Inhibition by Deoxy Analogues of the Resorcylic Lactone L-783277 ACS Med Chem Lett2:22-27 (2011) 
 
Ephrin type-A receptor 4
Name:Ephrin type-A receptor 4
Type:PROTEIN
Mol. Mass.:109859.29
Organism:Homo sapiens (Human)
Description:ChEMBL_586961
Residue:986
BDBM50413752
NameBDBM50413752
Synonyms:CHEMBL2012519 | L-783277
TypeSmall organic molecule
Emp. Form.C19H24O7
Mol. Mass.364.3897
SMILESCOc1cc(O)c2c(CCCC(=O)C(=O)C(O)CCC[C@H](C)OC2=O)c1