Reaction Details
TargetLysosomal alpha-glucosidase
LigandBDBM50299749
Substrate/Competitorn/a
Meas. Tech.ChEMBL_701785 (CHEMBL1656922)
IC50 4000±n/a nM
Citation Ghisaidoobe, ABikker, Pde Bruijn, ACGodschalk, FDRogaar, EGuijt, MCHagens, PHalma, JMHart, SMLuitjens, SBvan Rixel, VHWijzenbroek, MZweegers, TDonker-Koopman, WEStrijland, ABoot, RMarel, GvOverkleeft, HSAerts, JM Identification of Potent and Selective Glucosylceramide Synthase Inhibitors from a Library of N-Alkylated Iminosugars ACS Med Chem Lett2:119-123 (2011) 
 
Lysosomal alpha-glucosidase
Name:Lysosomal alpha-glucosidase
Type:Enzyme
Mol. Mass.:106235.32
Organism:Mus musculus (Mouse)
Description:P70699
Residue:953
BDBM50299749
NameBDBM50299749
Synonyms:(2R,3R,4R,5S)-1-[5-(Adamantan-1-ylmethoxy)-pentyl]-2-hydroxymethyl-piperidine-3,4,5-triol N-adamantanemethyloxypentyl-1-deoxynojirimycin
TypeSmall organic molecule
Emp. Form.C22H39NO5
Mol. Mass.397.5488
SMILESOC[C@@H]1[C@@H](O)[C@H](O)[C@@H](O)CN1CCCCCOCC12CC3CC(CC(C3)C1)C2