Reaction Details
TargetNon-lysosomal glucosylceramidase
LigandBDBM50335384
Substrate/Competitorn/a
Meas. Tech.ChEMBL_701782 (CHEMBL1656919)
IC50 25±n/a nM
Citation Ghisaidoobe, ABikker, Pde Bruijn, ACGodschalk, FDRogaar, EGuijt, MCHagens, PHalma, JMHart, SMLuitjens, SBvan Rixel, VHWijzenbroek, MZweegers, TDonker-Koopman, WEStrijland, ABoot, RMarel, GvOverkleeft, HSAerts, JM Identification of Potent and Selective Glucosylceramide Synthase Inhibitors from a Library of N-Alkylated Iminosugars ACS Med Chem Lett2:119-123 (2011) 
 
Non-lysosomal glucosylceramidase
Name:Non-lysosomal glucosylceramidase
Type:PROTEIN
Mol. Mass.:104639.04
Organism:Homo sapiens (Human)
Description:ChEMBL_1435476
Residue:927
BDBM50335384
NameBDBM50335384
Synonyms:CHEMBL1651636 | N-Hexoxypentyl-L-ido-1-deoxynojirimycin
TypeSmall organic molecule
Emp. Form.C17H35NO5
Mol. Mass.333.4635
SMILESCCCCCCOCCCCCN1C[C@H](O)[C@@H](O)[C@H](O)[C@@H]1CO