Reaction Details
TargetCeramide glucosyltransferase
LigandBDBM50312527
Substrate/Competitorn/a
Meas. Tech.ChEMBL_701780 (CHEMBL1656917)
IC50 100±n/a nM
Citation Ghisaidoobe, ABikker, Pde Bruijn, ACGodschalk, FDRogaar, EGuijt, MCHagens, PHalma, JMHart, SMLuitjens, SBvan Rixel, VHWijzenbroek, MZweegers, TDonker-Koopman, WEStrijland, ABoot, RMarel, GvOverkleeft, HSAerts, JM Identification of Potent and Selective Glucosylceramide Synthase Inhibitors from a Library of N-Alkylated Iminosugars ACS Med Chem Lett2:119-123 (2011) 
 
Ceramide glucosyltransferase
Name:Ceramide glucosyltransferase
Type:PROTEIN
Mol. Mass.:44844.15
Organism:Mus musculus
Description:ChEMBL_809643
Residue:394
BDBM50312527
NameBDBM50312527
Synonyms:CHEMBL1086996 | N-[5-(Adamantan-1-yl-methoxy)-pentyl]-L-ido-1-deoxynojirimycin
TypeSmall organic molecule
Emp. Form.C22H39NO5
Mol. Mass.397.5488
SMILESOC[C@H]1[C@@H](O)[C@H](O)[C@@H](O)CN1CCCCCOCC12CC3CC(CC(C3)C1)C2