Reaction Details
TargetNeuraminidase
LigandBDBM50330326
Substrate/Competitorn/a
Meas. Tech.ChEMBL_709673 (CHEMBL1652978)
IC50 0.6±n/a nM
Citation Govorkova, EAIlyushina, NAMcClaren, JLNaipospos, TSDouangngeun, BWebster, RG Susceptibility of highly pathogenic H5N1 influenza viruses to the neuraminidase inhibitor oseltamivir differs in vitro and in a mouse model. Antimicrob Agents Chemother53:3088-96 (2009) 
 
Neuraminidase
Name:Neuraminidase
Synonyms:n/a
Type:PROTEIN
Mol. Mass.:49178.82
Organism:Influenza A virus
Description:ChEMBL_709408
Residue:449
BDBM50330326
NameBDBM50330326
TypeSmall organic molecule
Emp. Form.C12H20N4O7
Mol. Mass.332.3098
SMILES[#6]-[#6](=O)-[#7]-[#6@@H]-1-[#6@H](-[#6]=[#6](-[#8]-[#6@H]-1-[#6@H](-[#8])-[#6@H](-[#8])-[#6]-[#8])-[#6](-[#8])=O)\[#7]=[#6](\[#7])-[#7]