Reaction Details
TargetAcetylcholinesterase
LigandBDBM50335637
Substrate/Competitorn/a
Meas. Tech.ChEMBL_715592 (CHEMBL1663475)
IC50 13000±n/a nM
Citation Tomassoli, IIsmaili, LPudlo, Mde Los Ríos, CSoriano, EColmena, IGandía, LRivas, LSamadi, AMarco-Contelles, JRefouvelet, B Synthesis, biological assessment and molecular modeling of new dihydroquinoline-3-carboxamides and dihydroquinoline-3-carbohydrazide derivatives as cholinesterase inhibitors, and Ca channel antagonists. Eur J Med Chem46:1-10 (2010) 
 
Acetylcholinesterase
Name:Acetylcholinesterase
Type:Enzyme
Mol. Mass.:71812.79
Organism:Electrophorus electricus (Electric eel)
Description:n/a
Residue:633
BDBM50335637
NameBDBM50335637
Synonyms:CHEMBL1651810 | N-[2-({2-[(2-Aminoethyl)amino]ethyl}amino)ethyl]-4-hydroxy-2-oxo-1,2-dihydroquinoline-3-carboxamide
TypeSmall organic molecule
Emp. Form.C16H23N5O3
Mol. Mass.333.3855
SMILESNCCNCCNCCNC(=O)c1c(O)c2ccccc2[nH]c1=O