Reaction Details
TargetCannabinoid receptor 2
LigandBDBM50324634
Substrate/Competitorn/a
Meas. Tech.ChEMBL_717853 (CHEMBL1670561)
Ki 0.7±n/a nM
Citation Brogi, SCorelli, FDi Marzo, VLigresti, AMugnaini, CPasquini, STafi, A Three-dimensional quantitative structure-selectivity relationships analysis guided rational design of a highly selective ligand for the cannabinoid receptor 2. Eur J Med Chem46:547-55 (2011) 
 
Cannabinoid receptor 2
Name:Cannabinoid receptor 2
Type:G Protein-Coupled Receptor (GPCR)
Mol. Mass.:39690.94
Organism:Homo sapiens (Human)
Description:P34972
Residue:360
BDBM50324634
NameBDBM50324634
Synonyms:CHEMBL1215942 | N-(Adamantan-1-yl)-6-(furan-2-yl)-4-oxo-1-pentyl-1,4-dihydroquinoline-3-carboxamide
TypeSmall organic molecule
Emp. Form.C29H34N2O3
Mol. Mass.458.5919
SMILESCCCCCn1cc(C(=O)NC23CC4CC(CC(C4)C2)C3)c(=O)c2cc(ccc12)-c1ccco1