Reaction Details
TargetCannabinoid receptor 2
LigandBDBM21266
Substrate/Competitorn/a
Meas. Tech.ChEMBL_717853 (CHEMBL1670561)
Ki 1.3±n/a nM
Citation Brogi, SCorelli, FDi Marzo, VLigresti, AMugnaini, CPasquini, STafi, A Three-dimensional quantitative structure-selectivity relationships analysis guided rational design of a highly selective ligand for the cannabinoid receptor 2. Eur J Med Chem46:547-55 (2011) 
 
Cannabinoid receptor 2
Name:Cannabinoid receptor 2
Type:G Protein-Coupled Receptor (GPCR)
Mol. Mass.:39690.94
Organism:Homo sapiens (Human)
Description:P34972
Residue:360
BDBM21266
NameBDBM21266
Synonyms:N-cyclohexyl-1-(3,4-dichlorophenyl)-5-(2,5-dimethyl-1H-pyrrol-1-yl)-4-methyl-1H-pyrazole-3-carboxamide | Pyrazole-3-carboxamide analogue, 33
TypeSmall organic molecule
Emp. Form.C23H26Cl2N4O
Mol. Mass.445.385
SMILESCc1ccc(C)n1-c1c(C)c(nn1-c1ccc(Cl)c(Cl)c1)C(=O)NC1CCCCC1