Reaction Details
TargetCannabinoid receptor 2
LigandBDBM50303575
Substrate/Competitorn/a
Meas. Tech.ChEMBL_717853 (CHEMBL1670561)
Ki 11±n/a nM
Citation Brogi, SCorelli, FDi Marzo, VLigresti, AMugnaini, CPasquini, STafi, A Three-dimensional quantitative structure-selectivity relationships analysis guided rational design of a highly selective ligand for the cannabinoid receptor 2. Eur J Med Chem46:547-55 (2011) 
 
Cannabinoid receptor 2
Name:Cannabinoid receptor 2
Type:G Protein-Coupled Receptor (GPCR)
Mol. Mass.:39690.94
Organism:Homo sapiens (Human)
Description:P34972
Residue:360
BDBM50303575
NameBDBM50303575
Synonyms:CHEMBL570907 | Cyclopentyl(1-((tetrahydro-2H-pyran-4-yl)methyl)-1H-indol-3-yl)methanone
TypeSmall organic molecule
Emp. Form.C20H25NO2
Mol. Mass.311.418
SMILESO=C(C1CCCC1)c1cn(CC2CCOCC2)c2ccccc12