Reaction Details
TargetCannabinoid receptor 2
LigandBDBM50239215
Substrate/Competitorn/a
Meas. Tech.ChEMBL_717853 (CHEMBL1670561)
Ki 34±n/a nM
Citation Brogi, SCorelli, FDi Marzo, VLigresti, AMugnaini, CPasquini, STafi, A Three-dimensional quantitative structure-selectivity relationships analysis guided rational design of a highly selective ligand for the cannabinoid receptor 2. Eur J Med Chem46:547-55 (2011) 
 
Cannabinoid receptor 2
Name:Cannabinoid receptor 2
Type:G Protein-Coupled Receptor (GPCR)
Mol. Mass.:39690.94
Organism:Homo sapiens (Human)
Description:P34972
Residue:360
BDBM50239215
NameBDBM50239215
Synonyms:4-methyl-3-(morpholinosulfonyl)-N-(2,2,4,4-tetramethylpentan-3-yl)benzamide | CHEMBL258242
TypeSmall organic molecule
Emp. Form.C21H34N2O4S
Mol. Mass.410.571
SMILESCc1ccc(cc1S(=O)(=O)N1CCOCC1)C(=O)NC(C(C)(C)C)C(C)(C)C