Reaction Details
TargetCannabinoid receptor 1
LigandBDBM50303575
Substrate/Competitorn/a
Meas. Tech.ChEMBL_717852 (CHEMBL1670560)
Ki 131±n/a nM
Citation Brogi, SCorelli, FDi Marzo, VLigresti, AMugnaini, CPasquini, STafi, A Three-dimensional quantitative structure-selectivity relationships analysis guided rational design of a highly selective ligand for the cannabinoid receptor 2. Eur J Med Chem46:547-55 (2011) 
 
Cannabinoid receptor 1
Name:Cannabinoid receptor 1
Type:G Protein-Coupled Receptor (GPCR)
Mol. Mass.:52868.96
Organism:Homo sapiens (Human)
Description:P21554
Residue:472
BDBM50303575
NameBDBM50303575
Synonyms:CHEMBL570907 | Cyclopentyl(1-((tetrahydro-2H-pyran-4-yl)methyl)-1H-indol-3-yl)methanone
TypeSmall organic molecule
Emp. Form.C20H25NO2
Mol. Mass.311.418
SMILESO=C(C1CCCC1)c1cn(CC2CCOCC2)c2ccccc12