Reaction Details
TargetCannabinoid receptor 1
LigandBDBM50277194
Substrate/Competitorn/a
Meas. Tech.ChEMBL_717852 (CHEMBL1670560)
Ki 200±n/a nM
Citation Brogi, SCorelli, FDi Marzo, VLigresti, AMugnaini, CPasquini, STafi, A Three-dimensional quantitative structure-selectivity relationships analysis guided rational design of a highly selective ligand for the cannabinoid receptor 2. Eur J Med Chem46:547-55 (2011) 
 
Cannabinoid receptor 1
Name:Cannabinoid receptor 1
Type:G Protein-Coupled Receptor (GPCR)
Mol. Mass.:52868.96
Organism:Homo sapiens (Human)
Description:P21554
Residue:472
BDBM50277194
NameBDBM50277194
Synonyms:4-(2-methyl-5-(4-neopentylthiazol-2-yl)phenylsulfonyl)morpholine | CHEMBL474897
TypeSmall organic molecule
Emp. Form.C19H26N2O3S2
Mol. Mass.394.551
SMILESCc1ccc(cc1S(=O)(=O)N1CCOCC1)-c1nc(CC(C)(C)C)cs1