Reaction Details
TargetNeuronal acetylcholine receptor subunit beta-2
LigandBDBM50336020
Substrate/Competitorn/a
Meas. Tech.ChEMBL_717231 (CHEMBL1669854)
Ki 39000±n/a nM
Citation Lin, SWSun, QGe, ZMWang, XYe, JLi, RT Synthesis and structure-analgesic activity relationships of a novel series of monospirocyclopiperazinium salts (MSPZ). Bioorg Med Chem Lett21:940-3 (2011) 
 
Neuronal acetylcholine receptor subunit beta-2
Name:Neuronal acetylcholine receptor subunit beta-2
Type:Protein
Mol. Mass.:57020.50
Organism:Homo sapiens (Human)
Description:P17787
Residue:502
BDBM50336020
NameBDBM50336020
Synonyms:CHEMBL1669092 | N,N,N-trimethyl-1-(4-styrylphenoxy)propan-2-aminium iodide
TypeSmall organic molecule
Emp. Form.C20H26NO
Mol. Mass.296.426
SMILESCC(COc1ccc(\C=C/c2ccccc2)cc1)[N+](C)(C)C