Reaction Details
TargetInhibitor of nuclear factor kappa-B kinase subunit beta
LigandBDBM50336169
Substrate/Competitorn/a
Meas. Tech.ChEMBL_716440 (CHEMBL1670064)
IC50 2.2±n/a nM
Citation Xie, JPoda, GIHu, YChen, NXHeier, RFWolfson, SGReding, MTLennon, PJKurumbail, RGSelness, SRLi, XKishore, NNSommers, CDChristine, LBonar, SLVenkatraman, NMathialagan, SBrustkern, SJHuang, HC Aminopyridinecarboxamide-based inhaled IKK-2 inhibitors for asthma and COPD: Structure-activity relationship. Bioorg Med Chem19:1242-55 (2011) 
 
Inhibitor of nuclear factor kappa-B kinase subunit beta
Name:Inhibitor of nuclear factor kappa-B kinase subunit beta
Type:Serine/threonine-protein kinase
Mol. Mass.:86554.39
Organism:Homo sapiens (Human)
Description:GST-tagged IKK-2 was expressed in High Five cells and purified.
Residue:756
BDBM50336169
NameBDBM50336169
Synonyms:8-(5-chloro-2-(4-methylpiperazin-1-yl)isonicotinamido)-1-(4-chloro-3-hydroxyphenyl)-4,5-dihydro-1H-benzo[g]indazole-3-carboxamide | CHEMBL1669560
TypeSmall organic molecule
Emp. Form.C29H27Cl2N7O3
Mol. Mass.592.476
SMILESCN1CCN(CC1)c1cc(C(=O)Nc2ccc3CCc4c(nn(c4-c3c2)-c2ccc(Cl)c(O)c2)C(N)=O)c(Cl)cn1