Reaction Details
TargetInhibitor of nuclear factor kappa-B kinase subunit beta
LigandBDBM50336172
Substrate/Competitorn/a
Meas. Tech.ChEMBL_716440 (CHEMBL1670064)
IC50 0.6±n/a nM
Citation Xie, JPoda, GIHu, YChen, NXHeier, RFWolfson, SGReding, MTLennon, PJKurumbail, RGSelness, SRLi, XKishore, NNSommers, CDChristine, LBonar, SLVenkatraman, NMathialagan, SBrustkern, SJHuang, HC Aminopyridinecarboxamide-based inhaled IKK-2 inhibitors for asthma and COPD: Structure-activity relationship. Bioorg Med Chem19:1242-55 (2011) 
 
Inhibitor of nuclear factor kappa-B kinase subunit beta
Name:Inhibitor of nuclear factor kappa-B kinase subunit beta
Type:Serine/threonine-protein kinase
Mol. Mass.:86554.39
Organism:Homo sapiens (Human)
Description:GST-tagged IKK-2 was expressed in High Five cells and purified.
Residue:756
BDBM50336172
NameBDBM50336172
Synonyms:8-(5-chloro-2-(4-hydroxypiperidin-1-yl)isonicotinamido)-1-(4-fluorophenyl)-4,5-dihydro-1H-benzo[g]indazole-3-carboxamide | CHEMBL1669562
TypeSmall organic molecule
Emp. Form.C29H26ClFN6O3
Mol. Mass.561.007
SMILESNC(=O)c1nn(c-2c1CCc1ccc(NC(=O)c3cc(ncc3Cl)N3CCC(O)CC3)cc-21)-c1ccc(F)cc1