Reaction Details
TargetInhibitor of nuclear factor kappa-B kinase subunit beta
LigandBDBM50336181
Substrate/Competitorn/a
Meas. Tech.ChEMBL_716440 (CHEMBL1670064)
IC50 0.5±n/a nM
Citation Xie, JPoda, GIHu, YChen, NXHeier, RFWolfson, SGReding, MTLennon, PJKurumbail, RGSelness, SRLi, XKishore, NNSommers, CDChristine, LBonar, SLVenkatraman, NMathialagan, SBrustkern, SJHuang, HC Aminopyridinecarboxamide-based inhaled IKK-2 inhibitors for asthma and COPD: Structure-activity relationship. Bioorg Med Chem19:1242-55 (2011) 
 
Inhibitor of nuclear factor kappa-B kinase subunit beta
Name:Inhibitor of nuclear factor kappa-B kinase subunit beta
Type:Serine/threonine-protein kinase
Mol. Mass.:86554.39
Organism:Homo sapiens (Human)
Description:GST-tagged IKK-2 was expressed in High Five cells and purified.
Residue:756
BDBM50336181
NameBDBM50336181
Synonyms:1-(4-{[3-Carbamoyl-1-(4-fluorophenyl)-4,5-dihydro-1H-benzo[g]indazol-8-yl]carbamoyl}-5-chloropyridin-2-yl)-4-[(1-methyl-1H-pyrazol-4-yl)methyl]piperazine-2-carboxylicacid | CHEMBL1669569
TypeSmall organic molecule
Emp. Form.C34H31ClFN9O4
Mol. Mass.684.119
SMILESCn1cc(CN2CCN(C(C2)C(O)=O)c2cc(C(=O)Nc3ccc4CCc5c(nn(c5-c4c3)-c3ccc(F)cc3)C(N)=O)c(Cl)cn2)cn1