Reaction Details
TargetInhibitor of nuclear factor kappa-B kinase subunit beta
LigandBDBM50336186
Substrate/Competitorn/a
Meas. Tech.ChEMBL_716440 (CHEMBL1670064)
IC50 2.8±n/a nM
Citation Xie, JPoda, GIHu, YChen, NXHeier, RFWolfson, SGReding, MTLennon, PJKurumbail, RGSelness, SRLi, XKishore, NNSommers, CDChristine, LBonar, SLVenkatraman, NMathialagan, SBrustkern, SJHuang, HC Aminopyridinecarboxamide-based inhaled IKK-2 inhibitors for asthma and COPD: Structure-activity relationship. Bioorg Med Chem19:1242-55 (2011) 
 
Inhibitor of nuclear factor kappa-B kinase subunit beta
Name:Inhibitor of nuclear factor kappa-B kinase subunit beta
Type:Serine/threonine-protein kinase
Mol. Mass.:86554.39
Organism:Homo sapiens (Human)
Description:GST-tagged IKK-2 was expressed in High Five cells and purified.
Residue:756
BDBM50336186
NameBDBM50336186
Synonyms:8-{[5-Chloro-2-(4-{[1-(3-methoxypropyl)-1H-pyrazol-4-yl]methyl}piperazin-1-yl)isonicotinoyl]amino}-1-(4-fluorophenyl)-4,5-dihydro-1H-benzo[g]indazole-3-carboxamide | CHEMBL1669593
TypeSmall organic molecule
Emp. Form.C36H37ClFN9O3
Mol. Mass.698.189
SMILESCOCCCn1cc(CN2CCN(CC2)c2cc(C(=O)Nc3ccc4CCc5c(nn(c5-c4c3)-c3ccc(F)cc3)C(N)=O)c(Cl)cn2)cn1