Reaction Details
TargetInhibitor of nuclear factor kappa-B kinase subunit beta
LigandBDBM50336193
Substrate/Competitorn/a
Meas. Tech.ChEMBL_716440 (CHEMBL1670064)
IC50 0.9±n/a nM
Citation Xie, JPoda, GIHu, YChen, NXHeier, RFWolfson, SGReding, MTLennon, PJKurumbail, RGSelness, SRLi, XKishore, NNSommers, CDChristine, LBonar, SLVenkatraman, NMathialagan, SBrustkern, SJHuang, HC Aminopyridinecarboxamide-based inhaled IKK-2 inhibitors for asthma and COPD: Structure-activity relationship. Bioorg Med Chem19:1242-55 (2011) 
 
Inhibitor of nuclear factor kappa-B kinase subunit beta
Name:Inhibitor of nuclear factor kappa-B kinase subunit beta
Type:Serine/threonine-protein kinase
Mol. Mass.:86554.39
Organism:Homo sapiens (Human)
Description:GST-tagged IKK-2 was expressed in High Five cells and purified.
Residue:756
BDBM50336193
NameBDBM50336193
Synonyms:8-{[2-(4-{[1-(2-Amino-2-oxoethyl)-1H-pyrazol-4-yl]methyl}piperazin-1-yl)-5-chloroisonicotinoyl]amino}-1-(4-fluorophenyl)-4,5-dihydro-1H-benzo[g]indazole-3-carboxamide | CHEMBL1669599
TypeSmall organic molecule
Emp. Form.C34H32ClFN10O3
Mol. Mass.683.134
SMILESNC(=O)Cn1cc(CN2CCN(CC2)c2cc(C(=O)Nc3ccc4CCc5c(nn(c5-c4c3)-c3ccc(F)cc3)C(N)=O)c(Cl)cn2)cn1