Reaction Details
TargetAldo-keto reductase family 1 member B1
LigandBDBM7460
Substrate/Competitorn/a
Meas. Tech.ChEMBL_716749 (CHEMBL1670631)
IC50 2850±n/a nM
Citation Zou, XQPeng, SMHu, CPTan, LFDeng, HWLi, YJ Furoxan nitric oxide donor coupled chrysin derivatives: synthesis and vasculoprotection. Bioorg Med Chem Lett21:1222-6 (2011) 
 
Aldo-keto reductase family 1 member B1
Name:Aldo-keto reductase family 1 member B1
Type:Protein
Mol. Mass.:35855.50
Organism:Homo sapiens (Human)
Description:P15121. 4LAU; 2IKI; 4LB4; 2FZD; 2FZ8; 1US0
Residue:316
BDBM7460
NameBDBM7460
Synonyms:2-(3,4-dihydroxyphenyl)-3,5,7-trihydroxy-4H-chromen-4-one 2-(3,4-dihydroxyphenyl)-3,5,7-trihydroxy-chromone;hydrate Quercetin Quercetin (21) US11021454, Compound Quercetin med.21724, Compound 4
TypeSmall organic molecule
Emp. Form.C15H10O7
Mol. Mass.302.2357
SMILESOc1cc(O)c2c(c1)oc(-c1ccc(O)c(O)c1)c(O)c2=O