Reaction Details
TargetAldo-keto reductase family 1 member B1
LigandBDBM7461
Substrate/Competitorn/a
Meas. Tech.ChEMBL_716749 (CHEMBL1670631)
IC50 7780±n/a nM
Citation Zou, XQPeng, SMHu, CPTan, LFDeng, HWLi, YJ Furoxan nitric oxide donor coupled chrysin derivatives: synthesis and vasculoprotection. Bioorg Med Chem Lett21:1222-6 (2011) 
 
Aldo-keto reductase family 1 member B1
Name:Aldo-keto reductase family 1 member B1
Type:Protein
Mol. Mass.:35855.50
Organism:Homo sapiens (Human)
Description:P15121. 4LAU; 2IKI; 4LB4; 2FZD; 2FZ8; 1US0
Residue:316
BDBM7461
NameBDBM7461
Synonyms:5,7-dihydroxy-2-phenyl-4H-chromen-4-one 5,7-dihydroxyflavone chrysin | cid_5281607
TypeSmall organic molecule
Emp. Form.C15H10O4
Mol. Mass.254.2375
SMILESOc1cc(O)c2c(c1)oc(cc2=O)-c1ccccc1