Reaction Details
TargetPhosphatidylinositol 4,5-bisphosphate 3-kinase catalytic subunit alpha isoform
LigandBDBM50336416
Substrate/Competitorn/a
Meas. Tech.ChEMBL_716816 (CHEMBL1670738)
Ki 100±n/a nM
Citation Liu, KKHuang, XBagrodia, SChen, JHGreasley, SCheng, HSun, SKnighton, DRodgers, CRafidi, KZou, AXiao, JYan, S Quinazolines with intra-molecular hydrogen bonding scaffold (iMHBS) as PI3K/mTOR dual inhibitors. Bioorg Med Chem Lett21:1270-4 (2011) 
 
Phosphatidylinositol 4,5-bisphosphate 3-kinase catalytic subunit alpha isoform
Name:Phosphatidylinositol 4,5-bisphosphate 3-kinase catalytic subunit alpha isoform
Type:Enzyme Subunit
Mol. Mass.:124294.87
Organism:Homo sapiens (Human)
Description:P42336
Residue:1068
BDBM50336416
NameBDBM50336416
Synonyms:4-amino-N-(6-(dimethylamino)pyridin-3-yl)-2,7-dimethylquinazoline-8-carboxamide | CHEMBL1668273
TypeSmall organic molecule
Emp. Form.C18H20N6O
Mol. Mass.336.391
SMILESCN(C)c1ccc(NC(=O)c2c(C)ccc3c(N)nc(C)nc23)cn1