Reaction Details
TargetSerine/threonine-protein kinase mTOR
LigandBDBM50336420
Substrate/Competitorn/a
Meas. Tech.ChEMBL_716817 (CHEMBL1670739)
Ki 21±n/a nM
Citation Liu, KKHuang, XBagrodia, SChen, JHGreasley, SCheng, HSun, SKnighton, DRodgers, CRafidi, KZou, AXiao, JYan, S Quinazolines with intra-molecular hydrogen bonding scaffold (iMHBS) as PI3K/mTOR dual inhibitors. Bioorg Med Chem Lett21:1270-4 (2011) 
 
Serine/threonine-protein kinase mTOR
Name:Serine/threonine-protein kinase mTOR
Type:Rapamycin target protein
Mol. Mass.:288917.12
Organism:Homo sapiens (Human)
Description:P42345
Residue:2549
BDBM50336420
NameBDBM50336420
Synonyms:4-amino-2-methyl-N-(1H-pyrazol-4-yl)quinazoline-8-carboxamide | CHEMBL1667869
TypeSmall organic molecule
Emp. Form.C13H12N6O
Mol. Mass.268.274
SMILESCc1nc(N)c2cccc(C(=O)Nc3cn[nH]c3)c2n1