Reaction Details
TargetDihydrofolate reductase
LigandBDBM50294211
Substrate/Competitorn/a
Meas. Tech.ChEMBL_723697 (CHEMBL1677367)
IC50 110000±n/a nM
Citation Bourne, CRBarrow, EWBunce, RABourne, PCBerlin, KDBarrow, WW Inhibition of antibiotic-resistant Staphylococcus aureus by the broad-spectrum dihydrofolate reductase inhibitor RAB1. Antimicrob Agents Chemother54:3825-33 (2010) 
 
Dihydrofolate reductase
Name:Dihydrofolate reductase
Type:Enzyme
Mol. Mass.:21453.99
Organism:Homo sapiens (Human)
Description:Recombinant human DHFR.
Residue:187
BDBM50294211
NameBDBM50294211
Synonyms:3-(5-((2,4-diaminopyrimidin-5-yl)methyl)-3-hydroxy-2-methoxyphenyl)-1-(1-propylphthalazin-2(1H)-yl)prop-2-en-1-one CHEMBL560502
TypeSmall organic molecule
Emp. Form.C26H28N6O3
Mol. Mass.472.5389
SMILESCCCC1N(N=Cc2ccccc12)C(=O)\C=C\c1cc(Cc2cnc(N)nc2N)cc(O)c1OC