Reaction Details
TargetDihydrofolate reductase
LigandBDBM50336512
Substrate/Competitorn/a
Meas. Tech.ChEMBL_723694 (CHEMBL1677364)
Ki 3.5±n/a nM
Citation Bourne, CRBarrow, EWBunce, RABourne, PCBerlin, KDBarrow, WW Inhibition of antibiotic-resistant Staphylococcus aureus by the broad-spectrum dihydrofolate reductase inhibitor RAB1. Antimicrob Agents Chemother54:3825-33 (2010) 
 
Dihydrofolate reductase
Name:Dihydrofolate reductase
Type:Enzyme
Mol. Mass.:18249.71
Organism:Staphylococcus aureus
Description:n/a
Residue:159
BDBM50336512
NameBDBM50336512
Synonyms:(R)-3-(5-((2,4-diaminopyrimidin-5-yl)methyl)-2,3-dimethoxyphenyl)-1-(1-(2-methoxypyrimidin-5-yl)phthalazin-2(1H)-yl)prop-2-en-1-one | CHEMBL1673173
TypeSmall organic molecule
Emp. Form.C29H28N8O4
Mol. Mass.552.5838
SMILESCOc1ncc(cn1)[C@@H]1N(N=Cc2ccccc12)C(=O)\C=C\c1cc(Cc2cnc(N)nc2N)cc(OC)c1OC