Reaction Details
TargetLanosterol 14a-demethylase
LigandBDBM50333117
Substrate/Competitorn/a
Meas. Tech.ChEMBL_724288 (CHEMBL1677681)
Kd 423±n/a nM
Citation Warrilow, AGMelo, NMartel, CMParker, JENes, WDKelly, SLKelly, DE Expression, purification, and characterization of Aspergillus fumigatus sterol 14-alpha demethylase (CYP51) isoenzymes A and B. Antimicrob Agents Chemother54:4225-34 (2010) 
 
Lanosterol 14a-demethylase
Name:Lanosterol 14a-demethylase
Synonyms:14-alpha sterol demethylase
Type:PROTEIN
Mol. Mass.:58939.22
Organism:Neosartorya fumigata
Description:ChEMBL_724288
Residue:524
BDBM50333117
NameBDBM50333117
TypeSmall organic molecule
Emp. Form.C16H14F3N5O
Mol. Mass.349.3105
SMILESC[C@@H](c1ncncc1F)[C@](O)(Cn1cncn1)c1ccc(F)cc1F