Reaction Details
TargetSterol 14-alpha demethylase cyp51A
LigandBDBM50181473
Substrate/Competitorn/a
Meas. Tech.ChEMBL_724287 (CHEMBL1677680)
Kd 2690±n/a nM
Citation Warrilow, AGMelo, NMartel, CMParker, JENes, WDKelly, SLKelly, DE Expression, purification, and characterization of Aspergillus fumigatus sterol 14-alpha demethylase (CYP51) isoenzymes A and B. Antimicrob Agents Chemother54:4225-34 (2010) 
 
Sterol 14-alpha demethylase cyp51A
Name:Sterol 14-alpha demethylase cyp51A
Synonyms:14-alpha sterol demethylase Cyp51A
Type:PROTEIN
Mol. Mass.:58079.92
Organism:Neosartorya fumigata (strain ATCC MYA-4609 / Af293 / CBS 101355 / FGSCA1100) (Aspergillus fumigatus)
Description:ChEMBL_724287
Residue:515
BDBM50181473
NameBDBM50181473
TypeSmall organic molecule
Emp. Form.C37H42F2N8O4
Mol. Mass.700.7774
SMILESCC[C@@H]([C@H](C)O)n1ncn(-c2ccc(cc2)N2CCN(CC2)c2ccc(OC[C@@H]3CO[C@](Cn4cncn4)(C3)c3ccc(F)cc3F)cc2)c1=O