Reaction Details
TargetLanosterol 14a-demethylase
LigandBDBM25817
Substrate/Competitorn/a
Meas. Tech.ChEMBL_724288 (CHEMBL1677681)
Kd 4030±n/a nM
Citation Warrilow, AGMelo, NMartel, CMParker, JENes, WDKelly, SLKelly, DE Expression, purification, and characterization of Aspergillus fumigatus sterol 14-alpha demethylase (CYP51) isoenzymes A and B. Antimicrob Agents Chemother54:4225-34 (2010) 
 
Lanosterol 14a-demethylase
Name:Lanosterol 14a-demethylase
Synonyms:14-alpha sterol demethylase
Type:PROTEIN
Mol. Mass.:58939.22
Organism:Neosartorya fumigata
Description:ChEMBL_724288
Residue:524
BDBM25817
NameBDBM25817
TypeSmall organic molecule
Emp. Form.C13H12F2N6O
Mol. Mass.306.2708
SMILESOC(Cn1cncn1)(Cn1cncn1)c1ccc(F)cc1F