Reaction Details
TargetSigma non-opioid intracellular receptor 1
LigandBDBM50048866
Substrate/Competitorn/a
Meas. Tech.ChEMBL_725391 (CHEMBL1676914)
Ki 0.38±n/a nM
Citation Abate, CNiso, MLacivita, EMosier, PDToscano, APerrone, R Analogues ofs receptor ligand 1-cyclohexyl-4-[3-(5-methoxy-1,2,3,4-tetrahydronaphthalen-1-yl)propyl]piperazine (PB28) with added polar functionality and reduced lipophilicity for potential use as positron emission tomography radiotracers. J Med Chem54:1022-32 (2011) 
 
Sigma non-opioid intracellular receptor 1
Name:Sigma non-opioid intracellular receptor 1
Type:Protein
Mol. Mass.:25307.17
Organism:Cavia porcellus (Guinea pig)
Description:Q60492
Residue:223
BDBM50048866
NameBDBM50048866
Synonyms:1-Cyclohexyl-4-[3-(5-methoxy-1,2,3,4-tetrahydro-naphthalen-1-yl)-propyl]-piperazine 1-cyclohexyl-4-[3-(5-methoxy-1,2,3,4-tetrahydro-naphthalen-1-yl)propyl]piperazine CHEMBL53325 | PB-28
TypeSmall organic molecule
Emp. Form.C24H38N2O
Mol. Mass.370.5713
SMILESCOc1cccc2C(CCCN3CCN(CC3)C3CCCCC3)CCCc12