Reaction Details
TargetKappa-type opioid receptor
LigandBDBM50336665
Substrate/Competitorn/a
Meas. Tech.ChEMBL_722916 (CHEMBL1674427)
Ki 0.132±n/a nM
Citation Nemoto, TYamamoto, NWatanabe, AFujii, HHasebe, KNakajima, MMochizuki, HNagase, H Synthesis of 6,14-epoxymorphinan derivatives and their pharmacologies. Bioorg Med Chem19:1205-21 (2011) 
 
Kappa-type opioid receptor
Name:Kappa-type opioid receptor
Type:G Protein-Coupled Receptor (GPCR)
Mol. Mass.:42744.99
Organism:Cavia porcellus (domestic guinea pig)
Description:P41144
Residue:380
BDBM50336665
NameBDBM50336665
Synonyms:CHEMBL1672469 | N-[(17-Cyclopropylmethyl-6beta,14beta-epoxy-3-hydroxymorphinan-6alpha-yl)methyl]-4-methylbenzamide
TypeSmall organic molecule
Emp. Form.C29H34N2O3
Mol. Mass.458.5919
SMILESCc1ccc(cc1)C(=O)NC[C@@]12CC[C@@]3(O1)[C@H]1Cc4ccc(O)cc4[C@]3(C2)CCN1CC1CC1