Reaction Details
TargetMu-type opioid receptor
LigandBDBM50336676
Substrate/Competitorn/a
Meas. Tech.ChEMBL_722917 (CHEMBL1674428)
Ki 0.243±n/a nM
Citation Nemoto, TYamamoto, NWatanabe, AFujii, HHasebe, KNakajima, MMochizuki, HNagase, H Synthesis of 6,14-epoxymorphinan derivatives and their pharmacologies. Bioorg Med Chem19:1205-21 (2011) 
 
Mu-type opioid receptor
Name:Mu-type opioid receptor
Type:Enzyme Catalytic Domain
Mol. Mass.:11165.58
Organism:GUINEA PIG
Description:P97266
Residue:98
BDBM50336676
NameBDBM50336676
Synonyms:CHEMBL1672483 | N-[(6beta,14beta-Epoxy-3-hydroxy-17-phenethylmorphinan-6alpa-yl)methyl]benzamide
TypeSmall organic molecule
Emp. Form.C32H34N2O3
Mol. Mass.494.624
SMILESOc1ccc2C[C@H]3N(CCc4ccccc4)CC[C@@]4(C[C@]5(CNC(=O)c6ccccc6)CC[C@@]34O5)c2c1