Reaction Details
TargetEndothelin-1 receptor
LigandBDBM50336696
Substrate/Competitorn/a
Meas. Tech.ChEMBL_723169 (CHEMBL1675391)
Ki 4.4±n/a nM
Citation Michel, KBüther, KLaw, MPWagner, SSchober, OHermann, SSchäfers, MRiemann, BHöltke, CKopka, K Development and evaluation of endothelin-A receptor (radio)ligands for positron emission tomography. J Med Chem54:939-48 (2011) 
 
Endothelin-1 receptor
Name:Endothelin-1 receptor
Type:PROTEIN
Mol. Mass.:48591.87
Organism:Mus musculus
Description:ChEMBL_723169
Residue:427
BDBM50336696
NameBDBM50336696
Synonyms:3-Benzo[1,3]dioxol-5-yl-4-[3-(2-{2-[2-(2-{1-[2-(2-{2-[2-(2-fluoropyridin-3-yloxy)ethoxy]ethoxy}ethoxy)-ethyl]-1H-1,2,3-triazol-4-ylmethoxy}ethoxy)ethoxy]ethoxy}ethoxy)-4,5-dimethoxybenzyl]-5-hydroxy-5-(4-methoxyphenyl)-5H-furan-2-one | CHEMBL1672882
TypeSmall organic molecule
Emp. Form.C51H61FN4O17
Mol. Mass.1021.045
SMILESCOc1ccc(cc1)C1(O)OC(=O)C(=C1Cc1cc(OC)c(OC)c(OCCOCCOCCOCCOCc2cn(CCOCCOCCOCCOc3cccnc3F)nn2)c1)c1ccc2OCOc2c1