Reaction Details
TargetMineralocorticoid receptor
LigandBDBM50336932
Substrate/Competitorn/a
Meas. Tech.ChEMBL_718598 (CHEMBL1680624)
IC50 2420±n/a nM
Citation Richardson, TIClarke, CAYu, KLYee, YKBleisch, TJLopez, JEJones, SAHughes, NEMuehl, BSLugar, CWMoore, TLShetler, PKZink, RWOsborne, JJMontrose-Rafizadeh, CPatel, NGeiser, AGGalvin, RJ Novel 3-Aryl Indoles as Progesterone Receptor Antagonists for Uterine Fibroids ACS Med Chem Lett2:148-153 (2011) 
 
Mineralocorticoid receptor
Name:Mineralocorticoid receptor
Type:Enzyme
Mol. Mass.:107076.42
Organism:Homo sapiens (Human)
Description:P08235
Residue:984
BDBM50336932
NameBDBM50336932
Synonyms:CHEMBL1672546 | N-(3-(4-cyano-3-methoxyphenyl)-1-isopropyl-1H-indol-6-yl)methanesulfonamide
TypeSmall organic molecule
Emp. Form.C20H21N3O3S
Mol. Mass.383.464
SMILESCOc1cc(ccc1C#N)-c1cn(C(C)C)c2cc(NS(C)(=O)=O)ccc12