Reaction Details
TargetAndrogen receptor
LigandBDBM50336929
Substrate/Competitorn/a
Meas. Tech.ChEMBL_718594 (CHEMBL1680620)
Ki 2550±n/a nM
Citation Richardson, TIClarke, CAYu, KLYee, YKBleisch, TJLopez, JEJones, SAHughes, NEMuehl, BSLugar, CWMoore, TLShetler, PKZink, RWOsborne, JJMontrose-Rafizadeh, CPatel, NGeiser, AGGalvin, RJ Novel 3-Aryl Indoles as Progesterone Receptor Antagonists for Uterine Fibroids ACS Med Chem Lett2:148-153 (2011) 
 
Androgen receptor
Name:Androgen receptor
Type:Receptor
Mol. Mass.:99185.27
Organism:Homo sapiens (Human)
Description:CHO cells were stably transfected with human AR gene.
Residue:920
BDBM50336929
NameBDBM50336929
Synonyms:(R)-N-(1-sec-butyl-3-(4-cyanophenyl)-1H-indol-6-yl)methanesulfonamide | CHEMBL1672549
TypeSmall organic molecule
Emp. Form.C20H21N3O2S
Mol. Mass.367.465
SMILESCC[C@@H](C)n1cc(-c2ccc(cc2)C#N)c2ccc(NS(C)(=O)=O)cc12