Reaction Details
TargetAndrogen receptor
LigandBDBM50228078
Substrate/Competitorn/a
Meas. Tech.ChEMBL_718594 (CHEMBL1680620)
Ki 211±n/a nM
Citation Richardson, TIClarke, CAYu, KLYee, YKBleisch, TJLopez, JEJones, SAHughes, NEMuehl, BSLugar, CWMoore, TLShetler, PKZink, RWOsborne, JJMontrose-Rafizadeh, CPatel, NGeiser, AGGalvin, RJ Novel 3-Aryl Indoles as Progesterone Receptor Antagonists for Uterine Fibroids ACS Med Chem Lett2:148-153 (2011) 
 
Androgen receptor
Name:Androgen receptor
Type:Receptor
Mol. Mass.:99185.27
Organism:Homo sapiens (Human)
Description:CHO cells were stably transfected with human AR gene.
Residue:920
BDBM50228078
NameBDBM50228078
Synonyms:(S)-N-(3-(1-cyclopropyl-1-(2,4-difluorophenyl)ethyl)-1H-indol-7-yl)methanesulfonamide | CHEMBL235206
TypeSmall organic molecule
Emp. Form.C20H20F2N2O2S
Mol. Mass.390.447
SMILESC[C@](C1CC1)(c1c[nH]c2c(NS(C)(=O)=O)cccc12)c1ccc(F)cc1F