Reaction Details
TargetMineralocorticoid receptor
LigandBDBM50336937
Substrate/Competitorn/a
Meas. Tech.ChEMBL_718593 (CHEMBL1680619)
Ki 86.8±n/a nM
Citation Richardson, TIClarke, CAYu, KLYee, YKBleisch, TJLopez, JEJones, SAHughes, NEMuehl, BSLugar, CWMoore, TLShetler, PKZink, RWOsborne, JJMontrose-Rafizadeh, CPatel, NGeiser, AGGalvin, RJ Novel 3-Aryl Indoles as Progesterone Receptor Antagonists for Uterine Fibroids ACS Med Chem Lett2:148-153 (2011) 
 
Mineralocorticoid receptor
Name:Mineralocorticoid receptor
Type:Enzyme
Mol. Mass.:107076.42
Organism:Homo sapiens (Human)
Description:P08235
Residue:984
BDBM50336937
NameBDBM50336937
Synonyms:3-[(4-methoxyphenyl)phenylmethyl]indole | CHEMBL1672540
TypeSmall organic molecule
Emp. Form.C22H19NO
Mol. Mass.313.3924
SMILESCOc1ccc(cc1)C(c1c[nH]c2ccccc12)c1ccccc1