Reaction Details
TargetAdenosine receptor A2b
LigandBDBM50336991
Substrate/Competitorn/a
Meas. Tech.ChEMBL_719009 (CHEMBL1679071)
Ki 1±n/a nM
Citation Eastwood, PEsteve, CGonzález, JFonquerna, SAiguadé, JCarranco, IsDoménech, TAparici, MsMiralpeix, MAlbertí, JCórdoba, MFernández, RPont, MsGodessart, NsPrats, NLoza, MsCadavid, MsNueda, A Discovery of LAS101057: A Potent, Selective, and Orally Efficacious A2B Adenosine Receptor Antagonist ACS Med Chem Lett2:213-218 (2011) 
 
Adenosine receptor A2b
Name:Adenosine receptor A2b
Type:G Protein-Coupled Receptor (GPCR)
Mol. Mass.:36341.22
Organism:Homo sapiens (Human)
Description:n/a
Residue:332
BDBM50336991
NameBDBM50336991
Synonyms:CHEMBL1672623 | N-[6-(2-Fluorophenyl)-5-pyridin-4-ylpyrazin-2-yl]cyclopropanecarboxamide
TypeSmall organic molecule
Emp. Form.C19H15FN4O
Mol. Mass.334.347
SMILESFc1ccccc1-c1nc(NC(=O)C2CC2)cnc1-c1ccncc1