Reaction Details
TargetAdenosine receptor A2a
LigandBDBM50336989
Substrate/Competitorn/a
Meas. Tech.ChEMBL_719010 (CHEMBL1679072)
Ki 1.2±n/a nM
Citation Eastwood, PEsteve, CGonzález, JFonquerna, SAiguadé, JCarranco, IsDoménech, TAparici, MsMiralpeix, MAlbertí, JCórdoba, MFernández, RPont, MsGodessart, NsPrats, NLoza, MsCadavid, MsNueda, A Discovery of LAS101057: A Potent, Selective, and Orally Efficacious A2B Adenosine Receptor Antagonist ACS Med Chem Lett2:213-218 (2011) 
 
Adenosine receptor A2a
Name:Adenosine receptor A2a
Type:G Protein-Coupled Receptor (GPCR)
Mol. Mass.:44716.46
Organism:Homo sapiens (Human)
Description:P29274
Residue:412
BDBM50336989
NameBDBM50336989
Synonyms:CHEMBL1672619 | N-[6-(5-Methyl-2-furyl)-5-pyridin-4-ylpyrazin-2-yl]cyclopropanecarboxamide
TypeSmall organic molecule
Emp. Form.C18H16N4O2
Mol. Mass.320.3452
SMILESCc1ccc(o1)-c1nc(NC(=O)C2CC2)cnc1-c1ccncc1