Reaction Details
TargetAldo-keto reductase family 1 member C3
LigandBDBM50337283
Substrate/Competitorn/a
Meas. Tech.ChEMBL_726380 (CHEMBL1687512)
IC50 62±n/a nM
Citation Adeniji, AOTwenter, BMByrns, MCJin, YWinkler, JDPenning, TM Discovery of substituted 3-(phenylamino)benzoic acids as potent and selective inhibitors of type 5 17ß-hydroxysteroid dehydrogenase (AKR1C3). Bioorg Med Chem Lett21:1464-8 (2011) 
 
Aldo-keto reductase family 1 member C3
Name:Aldo-keto reductase family 1 member C3
Type:Enzyme
Mol. Mass.:36859.86
Organism:Homo sapiens (Human)
Description:P42330
Residue:323
BDBM50337283
NameBDBM50337283
Synonyms:3-[N-(4-trifluoromethylphenyl)amino]benzoic acid US9271961, 7
TypeSmall organic molecule
Emp. Form.C14H10F3NO2
Mol. Mass.281.2299
SMILESOC(=O)c1cccc(Nc2ccc(cc2)C(F)(F)F)c1