Reaction Details
TargetAldo-keto reductase family 1 member C3
LigandBDBM50337282
Substrate/Competitorn/a
Meas. Tech.ChEMBL_726380 (CHEMBL1687512)
IC50 54±n/a nM
Citation Adeniji, AOTwenter, BMByrns, MCJin, YWinkler, JDPenning, TM Discovery of substituted 3-(phenylamino)benzoic acids as potent and selective inhibitors of type 5 17ß-hydroxysteroid dehydrogenase (AKR1C3). Bioorg Med Chem Lett21:1464-8 (2011) 
 
Aldo-keto reductase family 1 member C3
Name:Aldo-keto reductase family 1 member C3
Type:Enzyme
Mol. Mass.:36859.86
Organism:Homo sapiens (Human)
Description:P42330
Residue:323
BDBM50337282
NameBDBM50337282
Synonyms:3-[N-(4-acetylphenyl)amino]benzoic acid US9271961, 6
TypeSmall organic molecule
Emp. Form.C15H13NO3
Mol. Mass.255.2686
SMILESCC(=O)c1ccc(Nc2cccc(c2)C(O)=O)cc1