Reaction Details
TargetEpidermal growth factor receptor
LigandBDBM50337384
Substrate/Competitorn/a
Meas. Tech.ChEMBL_726535 (CHEMBL1685430)
Ki 27±n/a nM
Citation Akritopoulou-Zanze, IWakefield, BDGasiecki, AKalvin, DJohnson, EFKovar, PDjuric, SW Scaffold oriented synthesis. Part 4: design, synthesis and biological evaluation of novel 5-substituted indazoles as potent and selective kinase inhibitors employing heterocycle forming and multicomponent reactions. Bioorg Med Chem Lett21:1480-3 (2011) 
 
Epidermal growth factor receptor
Name:Epidermal growth factor receptor
Type:Receptor Kinase Domain
Mol. Mass.:134279.59
Organism:Homo sapiens (Human)
Description:P00533
Residue:1210
BDBM50337384
NameBDBM50337384
Synonyms:4-(3-(4-(4-fluorophenyl)-5-(1H-indazol-5-yl)-1H-imidazol-1-yl)propyl)morpholine | CHEMBL1682559
TypeSmall organic molecule
Emp. Form.C23H24FN5O
Mol. Mass.405.468
SMILESFc1ccc(cc1)-c1ncn(CCCN2CCOCC2)c1-c1ccc2[nH]ncc2c1