Reaction Details
TargetNeuromedin-K receptor
LigandBDBM50337411
Substrate/Competitorn/a
Meas. Tech.ChEMBL_728369 (CHEMBL1685145)
Ki 1.8±n/a nM
Citation Juhl, KHansen, TKehler, JKhanzhin, NANørgaard, MBRuhland, TLarsen, DBJensen, KGSteiniger-Brach, BNielsen, SMSimonsen, KB Identification of a new series of non-peptidic NK3 receptor antagonists. Bioorg Med Chem Lett21:1498-501 (2011) 
 
Neuromedin-K receptor
Name:Neuromedin-K receptor
Type:Enzyme
Mol. Mass.:52221.96
Organism:Homo sapiens (Human)
Description:P29371
Residue:465
BDBM50337411
NameBDBM50337411
Synonyms:(1S,2R)-1-(3,4-dichlorophenyl)-N-(4-fluorobenzyl)-N-methyl-2-((4-(2-oxo-2-(pyrrolidin-1-yl)ethyl)piperazin-1-yl)methyl)cyclopropanecarboxamide | CHEMBL1682676
TypeSmall organic molecule
Emp. Form.C29H35Cl2FN4O2
Mol. Mass.561.518
SMILESCN(Cc1ccc(F)cc1)C(=O)[C@]1(C[C@H]1CN1CCN(CC(=O)N2CCCC2)CC1)c1ccc(Cl)c(Cl)c1