Reaction Details
TargetNeuromedin-K receptor
LigandBDBM50337415
Substrate/Competitorn/a
Meas. Tech.ChEMBL_728369 (CHEMBL1685145)
Ki 7.6±n/a nM
Citation Juhl, KHansen, TKehler, JKhanzhin, NANørgaard, MBRuhland, TLarsen, DBJensen, KGSteiniger-Brach, BNielsen, SMSimonsen, KB Identification of a new series of non-peptidic NK3 receptor antagonists. Bioorg Med Chem Lett21:1498-501 (2011) 
 
Neuromedin-K receptor
Name:Neuromedin-K receptor
Type:Enzyme
Mol. Mass.:52221.96
Organism:Homo sapiens (Human)
Description:P29371
Residue:465
BDBM50337415
NameBDBM50337415
Synonyms:(1S,2R)-1-(3,4-dichlorophenyl)-2-((4-(N,N-dimethylsulfamoyl)piperazin-1-yl)methyl)-N-(4-fluorobenzyl)-N-methylcyclopropanecarboxamide | CHEMBL1682680
TypeSmall organic molecule
Emp. Form.C25H31Cl2FN4O3S
Mol. Mass.557.508
SMILESCN(C)S(=O)(=O)N1CCN(C[C@@H]2C[C@@]2(C(=O)N(C)Cc2ccc(F)cc2)c2ccc(Cl)c(Cl)c2)CC1