Reaction Details
TargetNeuromedin-K receptor
LigandBDBM50337438
Substrate/Competitorn/a
Meas. Tech.ChEMBL_728369 (CHEMBL1685145)
Ki 16±n/a nM
Citation Juhl, KHansen, TKehler, JKhanzhin, NANørgaard, MBRuhland, TLarsen, DBJensen, KGSteiniger-Brach, BNielsen, SMSimonsen, KB Identification of a new series of non-peptidic NK3 receptor antagonists. Bioorg Med Chem Lett21:1498-501 (2011) 
 
Neuromedin-K receptor
Name:Neuromedin-K receptor
Type:Enzyme
Mol. Mass.:52221.96
Organism:Homo sapiens (Human)
Description:P29371
Residue:465
BDBM50337438
NameBDBM50337438
Synonyms:CHEMBL1682640 | rac-2-((4-acetamido-4-phenylpiperidin-1-yl)methyl)-N-(2,4-dichlorobenzyl)-1-(3,4-dichlorophenyl)-N-methylcyclopropanecarboxamide
TypeSmall organic molecule
Emp. Form.C32H33Cl4N3O2
Mol. Mass.633.435
SMILESCN(Cc1ccc(Cl)cc1Cl)C(=O)C1(CC1CN1CCC(CC1)(NC(C)=O)c1ccccc1)c1ccc(Cl)c(Cl)c1