Reaction Details
TargetNeuromedin-K receptor
LigandBDBM50337441
Substrate/Competitorn/a
Meas. Tech.ChEMBL_728369 (CHEMBL1685145)
Ki 5.9±n/a nM
Citation Juhl, KHansen, TKehler, JKhanzhin, NANørgaard, MBRuhland, TLarsen, DBJensen, KGSteiniger-Brach, BNielsen, SMSimonsen, KB Identification of a new series of non-peptidic NK3 receptor antagonists. Bioorg Med Chem Lett21:1498-501 (2011) 
 
Neuromedin-K receptor
Name:Neuromedin-K receptor
Type:Enzyme
Mol. Mass.:52221.96
Organism:Homo sapiens (Human)
Description:P29371
Residue:465
BDBM50337441
NameBDBM50337441
Synonyms:CHEMBL1682643 | rac-2-((4-acetamido-4-phenylpiperidin-1-yl)methyl)-1-(3,4-dichlorophenyl)-N-(2,4-dimethoxybenzyl)-N-methylcyclopropanecarboxamide
TypeSmall organic molecule
Emp. Form.C34H39Cl2N3O4
Mol. Mass.624.597
SMILESCOc1ccc(CN(C)C(=O)C2(CC2CN2CCC(CC2)(NC(C)=O)c2ccccc2)c2ccc(Cl)c(Cl)c2)c(OC)c1