Reaction Details
TargetProthrombin
LigandBDBM50066333
Substrate/Competitorn/a
Meas. Tech.ChEMBL_728384 (CHEMBL1685160)
Ki 0.61±n/a nM
Citation Isaacs, RCNewton, CLCutrona, KJMercer, SPDorsey, BDMcDonough, CMCook, JJKrueger, JALewis, SDLucas, BJLyle, EALynch, JJMiller-Stein, CMichener, MTWallace, AAWhite, RBWong, BK P3 optimization of functional potency, in vivo efficacy and oral bioavailability in 3-aminopyrazinone thrombin inhibitors bearing non-charged groups at the P1 position. Bioorg Med Chem Lett21:1532-5 (2011) 
 
Prothrombin
Name:Prothrombin
Type:Protein
Mol. Mass.:70029.57
Organism:Homo sapiens (Human)
Description:P00734
Residue:622
BDBM50066333
NameBDBM50066333
Synonyms:(S)-1-((R)-2-Amino-2-cyclohexyl-acetyl)-pyrrolidine-2-carboxylic acid 5-chloro-2-cyclopropylcarbamoylmethoxy-benzylamide | CHEMBL108202
TypeSmall organic molecule
Emp. Form.C25H35ClN4O4
Mol. Mass.491.023
SMILESN[C@H](C1CCCCC1)C(=O)N1CCC[C@H]1C(=O)NCc1cc(Cl)ccc1OCC(=O)NC1CC1