Reaction Details
TargetProthrombin
LigandBDBM50337457
Substrate/Competitorn/a
Meas. Tech.ChEMBL_728384 (CHEMBL1685160)
Ki 8±n/a nM
Citation Isaacs, RCNewton, CLCutrona, KJMercer, SPDorsey, BDMcDonough, CMCook, JJKrueger, JALewis, SDLucas, BJLyle, EALynch, JJMiller-Stein, CMichener, MTWallace, AAWhite, RBWong, BK P3 optimization of functional potency, in vivo efficacy and oral bioavailability in 3-aminopyrazinone thrombin inhibitors bearing non-charged groups at the P1 position. Bioorg Med Chem Lett21:1532-5 (2011) 
 
Prothrombin
Name:Prothrombin
Type:Protein
Mol. Mass.:70029.57
Organism:Homo sapiens (Human)
Description:P00734
Residue:622
BDBM50337457
NameBDBM50337457
Synonyms:CHEMBL1682696 | N-(2-methoxy-5-methylbenzyl)-2-(6-methyl-2-oxo-3-(2-(pyridin-2-yl)ethylamino)pyrazin-1(2H)-yl)acetamide
TypeSmall organic molecule
Emp. Form.C23H27N5O3
Mol. Mass.421.4922
SMILESCOc1ccc(C)cc1CNC(=O)Cn1c(C)cnc(NCCc2ccccn2)c1=O