Reaction Details
TargetProthrombin
LigandBDBM50337463
Substrate/Competitorn/a
Meas. Tech.ChEMBL_728384 (CHEMBL1685160)
Ki 4.8±n/a nM
Citation Isaacs, RCNewton, CLCutrona, KJMercer, SPDorsey, BDMcDonough, CMCook, JJKrueger, JALewis, SDLucas, BJLyle, EALynch, JJMiller-Stein, CMichener, MTWallace, AAWhite, RBWong, BK P3 optimization of functional potency, in vivo efficacy and oral bioavailability in 3-aminopyrazinone thrombin inhibitors bearing non-charged groups at the P1 position. Bioorg Med Chem Lett21:1532-5 (2011) 
 
Prothrombin
Name:Prothrombin
Type:Protein
Mol. Mass.:70029.57
Organism:Homo sapiens (Human)
Description:P00734
Residue:622
BDBM50337463
NameBDBM50337463
Synonyms:(+/-)-N-(5-chloro-2-methoxybenzyl)-2-(6-methyl-2-oxo-3-(2-(piperidin-2-yl)ethylamino)pyrazin-1(2H)-yl)acetamide | CHEMBL1682758
TypeSmall organic molecule
Emp. Form.C22H30ClN5O3
Mol. Mass.447.958
SMILESCOc1ccc(Cl)cc1CNC(=O)Cn1c(C)cnc(NCCC2CCCCN2)c1=O