Reaction Details
TargetCarbonic anhydrase 2
LigandBDBM50337752
Substrate/Competitorn/a
Meas. Tech.ChEMBL_726762 (CHEMBL1686236)
Ki 78.9±n/a nM
Citation Maresca, ASupuran, CT (R)-/(S)-10-camphorsulfonyl-substituted aromatic/heterocyclic sulfonamides selectively inhibit mitochondrial over cytosolic carbonic anhydrases. Bioorg Med Chem Lett21:1334-7 (2011) 
 
Carbonic anhydrase 2
Name:Carbonic anhydrase 2
Type:Enzyme
Mol. Mass.:29250.71
Organism:Homo sapiens (Human)
Description:P00918
Residue:260
BDBM50337752
NameBDBM50337752
Synonyms:3-(((1R)-7,7-dimethyl-2-oxobicyclo[2.2.1]heptan-1-yl)methylsulfonamido)benzenesulfonamide | CHEMBL1683472
TypeSmall organic molecule
Emp. Form.C16H22N2O5S2
Mol. Mass.386.486
SMILESCC1(C)C2CC[C@]1(CS(=O)(=O)Nc1cccc(c1)S(N)(=O)=O)C(=O)C2