Reaction Details
TargetCarbonic anhydrase 5B, mitochondrial
LigandBDBM50337749
Substrate/Competitorn/a
Meas. Tech.ChEMBL_726764 (CHEMBL1686238)
Ki 67.3±n/a nM
Citation Maresca, ASupuran, CT (R)-/(S)-10-camphorsulfonyl-substituted aromatic/heterocyclic sulfonamides selectively inhibit mitochondrial over cytosolic carbonic anhydrases. Bioorg Med Chem Lett21:1334-7 (2011) 
 
Carbonic anhydrase 5B, mitochondrial
Name:Carbonic anhydrase 5B, mitochondrial
Type:Enzyme
Mol. Mass.:36440.83
Organism:Homo sapiens (Human)
Description:Human (cloned) isozyme
Residue:317
BDBM50337749
NameBDBM50337749
Synonyms:4-((((1S)-7,7-dimethyl-2-oxobicyclo[2.2.1]heptan-1-yl)methylsulfonamido)methyl)benzenesulfonamide | CHEMBL1683469
TypeSmall organic molecule
Emp. Form.C17H24N2O5S2
Mol. Mass.400.513
SMILESCC1(C)C2CC[C@@]1(CS(=O)(=O)NCc1ccc(cc1)S(N)(=O)=O)C(=O)C2